crudlet.org

Home > Failed To > Unable To Build Project It Requires Maven Version

Unable To Build Project It Requires Maven Version

Contents

more hot questions question feed default about us tour help blog chat data legal privacy policy work here advertising info mobile contact us feedback Technology Life / Arts Culture / Recreation posted 6 years ago Regarding "jre", I now understand. Added tag(s) pending. C:\Documents and Settings\Solar>D: D:\>cd simple D:\simple>mvn package [INFO] Scanning for projects... [INFO] ------------------------------------------------------------------------ [ERROR] FATAL ERROR [INFO] ------------------------------------------------------------------------ [INFO] Error building POM (may not be this project's POM). this content

Selection Path Priority Status ------------------------------------------------------------ * 0 /usr/share/maven2/bin/mvn 200 auto mode 1 /usr/share/maven/bin/mvn 150 manual mode 2 /usr/share/maven2/bin/mvn 200 manual mode A more sensible default might be setting the priority of I'm looking for Titina, Titina, my Titina, I've searched from Palistina, to London and Peru. Georgie Ranch Hand Posts: 72 posted 6 years ago Evan Caballero wrote: C:\Documents and Settings\Solar>D: very thank you, this looks very find, but look: C:\Documents and Settings\Solar>C:\Documents and Settings\Solar>D: [color=red]Access is Georgie Ranch Hand Posts: 72 posted 6 years ago at last i'm thankful for Peter Johnson, for lots of help, too, and especial thanks towards Mrs.

Failed To Execute Goal Org.apache.maven.plugins:maven-compiler-plugin:3.1:compile (default-compile)

Is anyone else having this problem? How would people living in eternal day learn that stars exist? an just now this one last gave me this error: (new install, actually) Microsoft Windows XP [Version 5.1.2600] (C) Copyright 1985-2001 Microsoft Corp. Now when it correctly declares to be 3.0.4 compatible, an older version of javadoc plugin is retrieved that works with 3.0.4.

When one batch file calls another, the first batch file stops processing and there is no "return". However, when I carry out the same process for Spark 1.5 it fails (see below). I tried it and voila, it worked. –Sanjay Mar 11 '15 at 14:13 add a comment| up vote 3 down vote Had the same problem. Failed To Execute Goal Org.apache.maven.plugins:maven-compiler-plugin:3.2:compile (default-compile) S.

This post has NOT been accepted by the mailing list yet. Joiner, Apr 23, 2014 #3 Offline Garris0n My BukkitDev ProfileMy Plugins (0) Joiner said: ↑ Thank you Garris0n. It says " Target is not a Maven home" –Sanjay Mar 10 '15 at 19:28 Try /usr/bin/mvn/apache-maven-3.2.1 you need in this folder subfolders like bin, boot, conf and lib S.

Of course it will not pause. 'mvn' is actually 'mvn.bat'. Org.apache.maven.lifecycle.lifecycleexecutionexception Failed To Execute Goal Reported by: Vincent Danjean Date: Thu, 6 Mar 2014 15:39:02 UTC Severity: important Found in version maven/3.0.5-1 Fixed in version maven/3.3.9-3 Done: Emmanuel Bourg Bug is archived. Georgie Ranch Hand Posts: 72 posted 6 years ago Evan Caballero wrote:the problem is that your pom refers to a parent pom (....). It requires a project with an existing po m.xml, but the build is not using one. [INFO] ------------------------------------------------------------------------ [INFO] For more information, run Maven with the -e switch [INFO] ------------------------------------------------------------------------ [INFO]

Failed To Execute Goal Org.apache.maven.plugins:maven-compiler-plugin:3.3:compile (default-compile)

If you are not the intended recipient (or authorised to receive for the recipient), please contact the sender by reply e-mail and delete all copies of this message. https://github.com/jawi/ols/issues/172 Sign in to comment Contact GitHub API Training Shop Blog About © 2016 GitHub, Inc. Failed To Execute Goal Org.apache.maven.plugins:maven-compiler-plugin:3.1:compile (default-compile) SKIPPED [INFO] Spark Project External Kafka Assembly .............. Org.apache.maven.plugin.compiler.compilationfailureexception: Compilation Failure remote: Total 254253 (delta 13), reused 0 (delta 0), pack-reused 254175 Receiving objects: 100% (254253/254253), 120.11 MiB | 974.00 KiB/s, done.

Comment 2 Milos Kleint 2007-10-23 12:10:15 UTC unfortunately the only solution to the problem is upgrade to a more current version of maven embedder. A Page of Puzzling Explain it to me like I'm a physics grad: Global Warming Son's music tastes Does a byte contain 8 bits, or 9? What are Iron nuggets and what can they be used for? Offline Joiner I created a new Maven Project for my plugin. Mojofailureexception In Maven

mvn -v), best regards Peter Johnson author Bartender Posts: 5856 7 I like... java -............. for artifact: org.sonatype.mavenbook.simple:parent:pom:0.8-SNAPSHOT from the specified remote repositories: central (http://repo1.maven.org/maven2, releases=true, snapshots=false) -> [Help 2] [ERROR] [ERROR] To see the full stack trace of the errors, re-run Maven with the -e Open a Command Prompt, cd to the project directory (c:\simple), and enter: mvn package Then post the full output that appears on the command prompt.

Here is Eclipse console. Caused By: Org.apache.maven.plugin.mojofailureexception: There Are Test Failures Thank you for reporting the bug, which will now be closed. Personal Open source Business Explore Sign up Sign in Pricing Blog Support Search GitHub This repository Watch 53 Star 233 Fork 60 jawi/ols Code Issues 97 Pull requests 0 Projects

svn: Network connection closed unexpectedly find similars Maven Core M3 Interceptor Java RT Plexus Hudson M2 0 Speed up your debug routine!

Can the product of two nonsymmetric matrices be symmetric? try this pom.xml : ........ SKIPPED [INFO] Spark Project External Kafka ....................... Maven Build Failure In Eclipse Thank you for your cooperation. [I removed the posts...] JBoss In Action Evan Caballero Ranch Hand Posts: 59 posted 6 years ago Ok Peter, sorry for that A.

the 2.0.x versions cannot be used because of severe bugs in project loading (that's why i ended up using the 2.1-SNAPSHOT in the first place) The current svn trunk work at This site uses cookies, as explained in our cookie policy. Mkyong.com is created, written by, and maintained by Yong Mook Kim, aka Mkyong. src -......

Run As >> Maven install - Doesn't work. daven -..................................... Browse other questions tagged java maven or ask your own question. You should have this (assuming c:\daven is the project's base directory, and smartsoft.daven.Box is the class' full package name) c:\daven\ + pom.xml + src\java\main\smartsoft\dave\Box.java In addition, to build the app you

Border